Reaction Details
TargetCytochrome P450 2D6
LigandBDBM50388472
Substrate/Competitorn/a
Meas. Tech.ChEMBL_829954 (CHEMBL2061659)
IC50>10000±n/a nM
Citation Ren, FDeng, GWang, HLuan, LMeng, QXu, QXu, HXu, XZhang, HZhao, BLi, CGuo, TBYang, JZhang, WZhao, YJia, QLu, HXiang, JNElliott, JDLin, X Discovery of novel 1,2,4-thiadiazole derivatives as potent, orally active agonists of sphingosine 1-phosphate receptor subtype 1 (S1P(1)). J Med Chem55:4286-96 (2012) 
 
Cytochrome P450 2D6
Name:Cytochrome P450 2D6
Type:Protein
Mol. Mass.:55774.82
Organism:Homo sapiens (Human)
Description:P10635
Residue:497
BDBM50388472
NameBDBM50388472
Synonyms:CHEMBL2059515
TypeSmall organic molecule
Emp. Form.C24H25N3O4
Mol. Mass.419.473
SMILESCCc1c(CCCC(O)=O)cccc1-c1noc(n1)-c1ccc(OC(C)C)c(c1)C#N