Reaction Details
TargetSphingosine 1-phosphate receptor 1
LigandBDBM50420118
Substrate/Competitorn/a
Meas. Tech.ChEMBL_829947 (CHEMBL2061652)
EC50 7.94±n/a nM
Citation Ren, FDeng, GWang, HLuan, LMeng, QXu, QXu, HXu, XZhang, HZhao, BLi, CGuo, TBYang, JZhang, WZhao, YJia, QLu, HXiang, JNElliott, JDLin, X Discovery of novel 1,2,4-thiadiazole derivatives as potent, orally active agonists of sphingosine 1-phosphate receptor subtype 1 (S1P(1)). J Med Chem55:4286-96 (2012) 
 
Sphingosine 1-phosphate receptor 1
Name:Sphingosine 1-phosphate receptor 1
Type:Enzyme
Mol. Mass.:42836.02
Organism:Homo sapiens (Human)
Description:P21453
Residue:382
BDBM50420118
NameBDBM50420118
Synonyms:CHEMBL2057284
TypeSmall organic molecule
Emp. Form.C26H28N4O2S
Mol. Mass.460.591
SMILESCCc1c(CN2CC(C2)C(O)=O)cccc1-c1nsc(n1)-c1ccc(CC(C)C)c(c1)C#N