Reaction Details
TargetSphingosine 1-phosphate receptor 1
LigandBDBM50420140
Substrate/Competitorn/a
Meas. Tech.ChEMBL_829947 (CHEMBL2061652)
EC50>3162.28±n/a nM
Citation Ren, FDeng, GWang, HLuan, LMeng, QXu, QXu, HXu, XZhang, HZhao, BLi, CGuo, TBYang, JZhang, WZhao, YJia, QLu, HXiang, JNElliott, JDLin, X Discovery of novel 1,2,4-thiadiazole derivatives as potent, orally active agonists of sphingosine 1-phosphate receptor subtype 1 (S1P(1)). J Med Chem55:4286-96 (2012) 
 
Sphingosine 1-phosphate receptor 1
Name:Sphingosine 1-phosphate receptor 1
Type:Enzyme
Mol. Mass.:42836.02
Organism:Homo sapiens (Human)
Description:P21453
Residue:382
BDBM50420140
NameBDBM50420140
Synonyms:CHEMBL2059673
TypeSmall organic molecule
Emp. Form.C26H29F3N4O2S
Mol. Mass.518.594
SMILESCCc1c(CCCC(O)=O)cccc1-c1nsc(n1)-c1ccc(N2CCN(C)CC2)c(c1)C(F)(F)F