Reaction Details
TargetGlucose-6-phosphate 1-dehydrogenase
LigandBDBM50388498
Substrate/Competitorn/a
Meas. Tech.ChEMBL_830110 (CHEMBL2061901)
IC50 6600±n/a nM
Citation Hamilton, NMDawson, MFairweather, EEHamilton, NSHitchin, JRJames, DIJones, SDJordan, AMLyons, AJSmall, HFThomson, GJWaddell, IDOgilvie, DJ Novel steroid inhibitors of glucose 6-phosphate dehydrogenase. J Med Chem55:4431-45 (2012) 
 
Glucose-6-phosphate 1-dehydrogenase
Name:Glucose-6-phosphate 1-dehydrogenase
Type:Enzyme
Mol. Mass.:59258.58
Organism:Homo sapiens (Human)
Description:P11413
Residue:515
BDBM50388498
NameBDBM50388498
Synonyms:CHEMBL2057297
TypeSmall organic molecule
Emp. Form.C20H33NO3S
Mol. Mass.367.546
SMILESC[C@]12CC[C@H]3[C@@H](CC[C@H]4C[C@H](CC[C@]34C)NS(C)(=O)=O)[C@@H]1CCC2=O