Reaction Details
TargetGlucose-6-phosphate 1-dehydrogenase
LigandBDBM50388492
Substrate/Competitorn/a
Meas. Tech.ChEMBL_830110 (CHEMBL2061901)
IC50 2000±n/a nM
Citation Hamilton, NMDawson, MFairweather, EEHamilton, NSHitchin, JRJames, DIJones, SDJordan, AMLyons, AJSmall, HFThomson, GJWaddell, IDOgilvie, DJ Novel steroid inhibitors of glucose 6-phosphate dehydrogenase. J Med Chem55:4431-45 (2012) 
 
Glucose-6-phosphate 1-dehydrogenase
Name:Glucose-6-phosphate 1-dehydrogenase
Type:Enzyme
Mol. Mass.:59258.58
Organism:Homo sapiens (Human)
Description:P11413
Residue:515
BDBM50388492
NameBDBM50388492
Synonyms:CHEMBL2057310
TypeSmall organic molecule
Emp. Form.C21H36N2O3S
Mol. Mass.396.587
SMILESCC(=O)[C@H]1CC[C@H]2[C@@H]3CC[C@H]4C[C@H](CC[C@]4(C)[C@H]3CC[C@]12C)NS(N)(=O)=O