Reaction Details
TargetGlucose-6-phosphate 1-dehydrogenase
LigandBDBM50388522
Substrate/Competitorn/a
Meas. Tech.ChEMBL_830110 (CHEMBL2061901)
IC50 1700±n/a nM
Citation Hamilton, NMDawson, MFairweather, EEHamilton, NSHitchin, JRJames, DIJones, SDJordan, AMLyons, AJSmall, HFThomson, GJWaddell, IDOgilvie, DJ Novel steroid inhibitors of glucose 6-phosphate dehydrogenase. J Med Chem55:4431-45 (2012) 
 
Glucose-6-phosphate 1-dehydrogenase
Name:Glucose-6-phosphate 1-dehydrogenase
Type:Enzyme
Mol. Mass.:59258.58
Organism:Homo sapiens (Human)
Description:P11413
Residue:515
BDBM50388522
NameBDBM50388522
Synonyms:CHEMBL2057294
TypeSmall organic molecule
Emp. Form.C24H40N2O2
Mol. Mass.388.5866
SMILESCCCCNC(=O)N[C@H]1CC[C@@]2(C)[C@@H](CC[C@H]3[C@@H]4CCC(=O)[C@@]4(C)CC[C@H]23)C1