Reaction Details
TargetVitamin D3 receptor
LigandBDBM50388530
Substrate/Competitorn/a
Meas. Tech.ChEMBL_830134 (CHEMBL2061944)
IC50 0.41±n/a nM
Citation Yoshimoto, NSakamaki, YHaeta, MKato, AInaba, YItoh, TNakabayashi, MIto, NYamamoto, K Butyl pocket formation in the vitamin D receptor strongly affects the agonistic or antagonistic behavior of ligands. J Med Chem55:4373-81 (2012) 
 
Vitamin D3 receptor
Name:Vitamin D3 receptor
Type:Protein
Mol. Mass.:48288.72
Organism:Homo sapiens (Human)
Description:P11473
Residue:427
BDBM50388530
NameBDBM50388530
Synonyms:CHEMBL2058274
TypeSmall organic molecule
Emp. Form.C32H54O3
Mol. Mass.486.7694
SMILES[#6]-[#6]-[#6]-[#6]-[#6@@H](-[#6]C([#8])([#6]-[#6])[#6]-[#6])-[#6@@H](-[#6])-[#6@H]1-[#6]-[#6]-[#6@H]2\[#6](-[#6]-[#6]-[#6][C@]12[#6])=[#6]\[#6]=[#6]-1\[#6]-[#6@@H](-[#8])-[#6](=[#6])-[#6@H](-[#8])-[#6]-1