Reaction Details
TargetPotassium voltage-gated channel subfamily H member 2
LigandBDBM50388534
Substrate/Competitorn/a
Meas. Tech.ChEMBL_830253 (CHEMBL2060804)
IC50 21900±n/a nM
Citation Nagle, AWu, TKuhen, KGagaring, KBorboa, RFrancek, CChen, ZPlouffe, DLin, XCaldwell, CEk, JSkolnik, SLiu, FWang, JChang, JLi, CLiu, BHollenbeck, TTuntland, TIsbell, JChuan, TAlper, PBFischli, CBrun, RLakshminarayana, SBRottmann, MDiagana, TTWinzeler, EAGlynne, RTully, DCChatterjee, AK Imidazolopiperazines: lead optimization of the second-generation antimalarial agents. J Med Chem55:4244-73 (2012) 
 
Potassium voltage-gated channel subfamily H member 2
Name:Potassium voltage-gated channel subfamily H member 2
Type:Multi-pass membrane protein
Mol. Mass.:126672.65
Organism:Homo sapiens (Human)
Description:Q12809
Residue:1159
BDBM50388534
NameBDBM50388534
Synonyms:CHEMBL2058837
TypeSmall organic molecule
Emp. Form.C24H27F2N5O
Mol. Mass.439.5009
SMILESCC(C)(N)C(=O)N1CCn2c(Nc3ccc(F)cc3)c(nc2C1(C)C)-c1ccc(F)cc1