Reaction Details
TargetPotassium voltage-gated channel subfamily H member 2
LigandBDBM50388535
Substrate/Competitorn/a
Meas. Tech.ChEMBL_830253 (CHEMBL2060804)
IC50>30000±n/a nM
Citation Nagle, AWu, TKuhen, KGagaring, KBorboa, RFrancek, CChen, ZPlouffe, DLin, XCaldwell, CEk, JSkolnik, SLiu, FWang, JChang, JLi, CLiu, BHollenbeck, TTuntland, TIsbell, JChuan, TAlper, PBFischli, CBrun, RLakshminarayana, SBRottmann, MDiagana, TTWinzeler, EAGlynne, RTully, DCChatterjee, AK Imidazolopiperazines: lead optimization of the second-generation antimalarial agents. J Med Chem55:4244-73 (2012) 
 
Potassium voltage-gated channel subfamily H member 2
Name:Potassium voltage-gated channel subfamily H member 2
Type:Multi-pass membrane protein
Mol. Mass.:126672.65
Organism:Homo sapiens (Human)
Description:Q12809
Residue:1159
BDBM50388535
NameBDBM50388535
Synonyms:CHEMBL2057225
TypeSmall organic molecule
Emp. Form.C22H22F3N5O
Mol. Mass.429.4382
SMILESCC1(C)N(CCn2c(Nc3ccc(F)c(F)c3)c(nc12)-c1ccc(F)cc1)C(=O)CN