Reaction Details
TargetM-phase inducer phosphatase 2
LigandBDBM50328823
Substrate/Competitorn/a
Meas. Tech.ChEMBL_830418 (CHEMBL2061096)
Ki 159000±n/a nM
Citation Lavecchia, ADi Giovanni, CPesapane, AMontuori, NRagno, PMartucci, NMMasullo, MDe Vendittis, ENovellino, E Discovery of new inhibitors of Cdc25B dual specificity phosphatases by structure-based virtual screening. J Med Chem55:4142-58 (2012) 
 
M-phase inducer phosphatase 2
Name:M-phase inducer phosphatase 2
Type:Protein
Mol. Mass.:64985.27
Organism:Homo sapiens (Human)
Description:n/a
Residue:580
BDBM50328823
NameBDBM50328823
Synonyms:5,5'-(3-(pyridin-2-yl)-1,2,4-triazine-5,6-diyl)difuran-2-sulfonic acid NSC-601364
TypeSmall organic molecule
Emp. Form.C16H10N4O8S2
Mol. Mass.450.403
SMILESOS(=O)(=O)c1ccc(o1)-c1nnc(nc1-c1ccc(o1)S(O)(=O)=O)-c1ccccn1