Reaction Details
TargetAcetyl-CoA carboxylase 2
LigandBDBM50388655
Substrate/Competitorn/a
Meas. Tech.ChEMBL_829263 (CHEMBL2060085)
IC50 4.9±n/a nM
Citation Kamata, MYamashita, TKina, ATawada, MEndo, SMizukami, ASasaki, MTani, ANakano, YWatanabe, YFuruyama, NFunami, MAmano, NFukatsu, K Symmetrical approach of spiro-pyrazolidinediones as acetyl-CoA carboxylase inhibitors. Bioorg Med Chem Lett22:4769-72 (2012) 
 
Acetyl-CoA carboxylase 2
Name:Acetyl-CoA carboxylase 2
Type:Protein
Mol. Mass.:276535.21
Organism:Homo sapiens (Human)
Description:O00763
Residue:2458
BDBM50388655
NameBDBM50388655
Synonyms:CHEMBL2059303
TypeSmall organic molecule
Emp. Form.C29H38N6O5S
Mol. Mass.582.714
SMILESCCNC(=O)Nc1sc2c(OC)cccc2c1C(=O)N1CCC(CC1)N1CCCC2(C1)C(=O)N1CCCCN1C2=O