Reaction Details
TargetAcetyl-CoA carboxylase 1
LigandBDBM50388656
Substrate/Competitorn/a
Meas. Tech.ChEMBL_829262 (CHEMBL2060084)
IC50 22±n/a nM
Citation Kamata, MYamashita, TKina, ATawada, MEndo, SMizukami, ASasaki, MTani, ANakano, YWatanabe, YFuruyama, NFunami, MAmano, NFukatsu, K Symmetrical approach of spiro-pyrazolidinediones as acetyl-CoA carboxylase inhibitors. Bioorg Med Chem Lett22:4769-72 (2012) 
 
Acetyl-CoA carboxylase 1
Name:Acetyl-CoA carboxylase 1
Type:Protein
Mol. Mass.:265543.22
Organism:Homo sapiens (Human)
Description:Q13085
Residue:2346
BDBM50388656
NameBDBM50388656
Synonyms:CHEMBL2059301
TypeSmall organic molecule
Emp. Form.C27H34N6O5S
Mol. Mass.554.661
SMILESCOc1cccc2c(C(=O)N3CCC(CC3)N3CCCC4(C3)C(=O)N3CCCCN3C4=O)c(NC(N)=O)sc12