Reaction Details
TargetMuscarinic acetylcholine receptor M1
LigandBDBM50388668
Substrate/Competitorn/a
Meas. Tech.ChEMBL_829274 (CHEMBL2060121)
EC50 73±n/a nM
Citation Sams, AGLarsen, KMikkelsen, GKHentzer, MChristoffersen, CTJensen, KGFrederiksen, KBang-Andersen, B Hit-to-lead investigation of a series of novel combined dopamine D2 and muscarinic M1 receptor ligands with putative antipsychotic and pro-cognitive potential. Bioorg Med Chem Lett22:5134-40 (2012) 
 
Muscarinic acetylcholine receptor M1
Name:Muscarinic acetylcholine receptor M1
Type:Protein
Mol. Mass.:51442.54
Organism:Homo sapiens (Human)
Description:P11229
Residue:460
BDBM50388668
NameBDBM50388668
Synonyms:CHEMBL2059311
TypeSmall organic molecule
Emp. Form.C23H26N4O3
Mol. Mass.406.4775
SMILESO=C1COc2ccccc2N1CCCN1CCC(CC1)n1c2ccccc2[nH]c1=O