Reaction Details
TargetMuscarinic acetylcholine receptor M1
LigandBDBM50388672
Substrate/Competitorn/a
Meas. Tech.ChEMBL_829274 (CHEMBL2060121)
EC50 110±n/a nM
Citation Sams, AGLarsen, KMikkelsen, GKHentzer, MChristoffersen, CTJensen, KGFrederiksen, KBang-Andersen, B Hit-to-lead investigation of a series of novel combined dopamine D2 and muscarinic M1 receptor ligands with putative antipsychotic and pro-cognitive potential. Bioorg Med Chem Lett22:5134-40 (2012) 
 
Muscarinic acetylcholine receptor M1
Name:Muscarinic acetylcholine receptor M1
Type:Protein
Mol. Mass.:51442.54
Organism:Homo sapiens (Human)
Description:P11229
Residue:460
BDBM50388672
NameBDBM50388672
Synonyms:CHEMBL2059324
TypeSmall organic molecule
Emp. Form.C23H25FN4O3
Mol. Mass.424.468
SMILESFc1cccc2n(C3CCN(CCCN4C(=O)COc5ccccc45)CC3)c(=O)[nH]c12