Reaction Details
TargetMuscarinic acetylcholine receptor M3
LigandBDBM10759
Substrate/Competitorn/a
Meas. Tech.ChEMBL_829280 (CHEMBL2060127)
EC50 3.2±n/a nM
Citation Sams, AGLarsen, KMikkelsen, GKHentzer, MChristoffersen, CTJensen, KGFrederiksen, KBang-Andersen, B Hit-to-lead investigation of a series of novel combined dopamine D2 and muscarinic M1 receptor ligands with putative antipsychotic and pro-cognitive potential. Bioorg Med Chem Lett22:5134-40 (2012) 
 
Muscarinic acetylcholine receptor M3
Name:Muscarinic acetylcholine receptor M3
Type:Enzyme
Mol. Mass.:66151.03
Organism:Homo sapiens (Human)
Description:P20309
Residue:590
BDBM10759
NameBDBM10759
Synonyms:2-acetoxyethyl(trimethyl)ammonium;bromide CHEMBL667 [2-(acetyloxy)ethyl]trimethylazanium acetylcholine chloride | cid_6060
TypeSmall Organic Molecule
Emp. Form.C7H16NO2
Mol. Mass.146.2069
SMILESCC(=O)OCC[N+](C)(C)C