Reaction Details
TargetPotassium voltage-gated channel subfamily H member 2
LigandBDBM50388683
Substrate/Competitorn/a
Meas. Tech.ChEMBL_829290 (CHEMBL2060137)
IC50 4400±n/a nM
Citation Sams, AGLarsen, KMikkelsen, GKHentzer, MChristoffersen, CTJensen, KGFrederiksen, KBang-Andersen, B Hit-to-lead investigation of a series of novel combined dopamine D2 and muscarinic M1 receptor ligands with putative antipsychotic and pro-cognitive potential. Bioorg Med Chem Lett22:5134-40 (2012) 
 
Potassium voltage-gated channel subfamily H member 2
Name:Potassium voltage-gated channel subfamily H member 2
Type:Multi-pass membrane protein
Mol. Mass.:126672.65
Organism:Homo sapiens (Human)
Description:Q12809
Residue:1159
BDBM50388683
NameBDBM50388683
Synonyms:CHEMBL2059322
TypeSmall organic molecule
Emp. Form.C23H25FN4O3
Mol. Mass.424.468
SMILESFc1ccc2[nH]c(=O)n(C3CCN(CCCN4C(=O)COc5ccccc45)CC3)c2c1