Reaction Details
TargetD(2) dopamine receptor
LigandBDBM50388682
Substrate/Competitorn/a
Meas. Tech.ChEMBL_829291 (CHEMBL2060138)
Ki 6.5±n/a nM
Citation Sams, AGLarsen, KMikkelsen, GKHentzer, MChristoffersen, CTJensen, KGFrederiksen, KBang-Andersen, B Hit-to-lead investigation of a series of novel combined dopamine D2 and muscarinic M1 receptor ligands with putative antipsychotic and pro-cognitive potential. Bioorg Med Chem Lett22:5134-40 (2012) 
 
D(2) dopamine receptor
Name:D(2) dopamine receptor
Type:Cell-surface receptors
Mol. Mass.:50647.10
Organism:Homo sapiens (Human)
Description:P14416
Residue:443
BDBM50388682
NameBDBM50388682
Synonyms:CHEMBL2059318
TypeSmall organic molecule
Emp. Form.C24H27FN4O2
Mol. Mass.422.4952
SMILESFc1ccc2N(CCCN3CCC(CC3)n3c4ccccc4[nH]c3=O)C(=O)CCc2c1