Reaction Details
TargetD(2) dopamine receptor
LigandBDBM50388672
Substrate/Competitorn/a
Meas. Tech.ChEMBL_829291 (CHEMBL2060138)
Ki 15±n/a nM
Citation Sams, AGLarsen, KMikkelsen, GKHentzer, MChristoffersen, CTJensen, KGFrederiksen, KBang-Andersen, B Hit-to-lead investigation of a series of novel combined dopamine D2 and muscarinic M1 receptor ligands with putative antipsychotic and pro-cognitive potential. Bioorg Med Chem Lett22:5134-40 (2012) 
 
D(2) dopamine receptor
Name:D(2) dopamine receptor
Type:Cell-surface receptors
Mol. Mass.:50647.10
Organism:Homo sapiens (Human)
Description:P14416
Residue:443
BDBM50388672
NameBDBM50388672
Synonyms:CHEMBL2059324
TypeSmall organic molecule
Emp. Form.C23H25FN4O3
Mol. Mass.424.468
SMILESFc1cccc2n(C3CCN(CCCN4C(=O)COc5ccccc45)CC3)c(=O)[nH]c12