Reaction Details
TargetD(2) dopamine receptor
LigandBDBM50388673
Substrate/Competitorn/a
Meas. Tech.ChEMBL_829291 (CHEMBL2060138)
Ki 42±n/a nM
Citation Sams, AGLarsen, KMikkelsen, GKHentzer, MChristoffersen, CTJensen, KGFrederiksen, KBang-Andersen, B Hit-to-lead investigation of a series of novel combined dopamine D2 and muscarinic M1 receptor ligands with putative antipsychotic and pro-cognitive potential. Bioorg Med Chem Lett22:5134-40 (2012) 
 
D(2) dopamine receptor
Name:D(2) dopamine receptor
Type:Cell-surface receptors
Mol. Mass.:50647.10
Organism:Homo sapiens (Human)
Description:P14416
Residue:443
BDBM50388673
NameBDBM50388673
Synonyms:CHEMBL2059305
TypeSmall organic molecule
Emp. Form.C25H29N3O
Mol. Mass.387.5173
SMILESO=C1CCc2ccccc2N1CCCN1CCC(CC1)c1ccc2[nH]ccc2c1