Reaction Details
Target5-hydroxytryptamine receptor 4
LigandBDBM50388694
Substrate/Competitorn/a
Meas. Tech.ChEMBL_829296 (CHEMBL2060286)
Ki 3.98±n/a nM
Citation Long, DDArmstrong, SRBeattie, DTChoi, SKFatheree, PRGendron, RAGoldblum, AAHumphrey, PPMarquess, DGShaw, JPSmith, JADerek Turner, SVickery, RG Discovery, oral pharmacokinetics and in vivo efficacy of a highly selective 5-HT4 receptor agonist: clinical compound TD-2749. Bioorg Med Chem Lett22:4849-53 (2012) 
 
5-hydroxytryptamine receptor 4
Name:5-hydroxytryptamine receptor 4
Type:Enzyme
Mol. Mass.:43767.54
Organism:Homo sapiens (Human)
Description:Q13639
Residue:388
BDBM50388694
NameBDBM50388694
Synonyms:CHEMBL2059585
TypeSmall organic molecule
Emp. Form.C26H40N6O4S
Mol. Mass.532.699
SMILESCC(C)n1nc(C(=O)N[C@@H]2C[C@@H]3CC[C@H](C2)N3CC(O)CN2CCN(CC2)S(C)(=O)=O)c2ccccc12