Reaction Details
Target5-hydroxytryptamine receptor 4
LigandBDBM50388699
Substrate/Competitorn/a
Meas. Tech.ChEMBL_829296 (CHEMBL2060286)
Ki 3.98±n/a nM
Citation Long, DDArmstrong, SRBeattie, DTChoi, SKFatheree, PRGendron, RAGoldblum, AAHumphrey, PPMarquess, DGShaw, JPSmith, JADerek Turner, SVickery, RG Discovery, oral pharmacokinetics and in vivo efficacy of a highly selective 5-HT4 receptor agonist: clinical compound TD-2749. Bioorg Med Chem Lett22:4849-53 (2012) 
 
5-hydroxytryptamine receptor 4
Name:5-hydroxytryptamine receptor 4
Type:Enzyme
Mol. Mass.:43767.54
Organism:Homo sapiens (Human)
Description:Q13639
Residue:388
BDBM50388699
NameBDBM50388699
Synonyms:CHEMBL2059581
TypeSmall organic molecule
Emp. Form.C27H41N5O3
Mol. Mass.483.6461
SMILESCOC[C@@H]1CCCN1CC(O)CN1[C@H]2CC[C@@H]1C[C@@H](C2)NC(=O)c1nn(C(C)C)c2ccccc12