Reaction Details
TargetSmoothened homolog
LigandBDBM50388710
Substrate/Competitorn/a
Meas. Tech.ChEMBL_829474 (CHEMBL2061994)
IC50 9±n/a nM
Citation Yang, BHird, AWRussell, DJFauber, BPDakin, LAZheng, XSu, QGodin, RBrassil, PDevereaux, EJanetka, JW Discovery of novel hedgehog antagonists from cell-based screening: Isosteric modification of p38 bisamides as potent inhibitors of SMO. Bioorg Med Chem Lett22:4907-11 (2012) 
 
Smoothened homolog
Name:Smoothened homolog
Type:Protein
Mol. Mass.:86415.51
Organism:Homo sapiens (Human)
Description:Q99835
Residue:787
BDBM50388710
NameBDBM50388710
Synonyms:CHEMBL2059868
TypeSmall organic molecule
Emp. Form.C24H22N4O2
Mol. Mass.398.4571
SMILESCc1[nH]cnc1-c1ccc(C)c(NC(=O)c2ccc(OCc3ccccn3)cc2)c1