Reaction Details
TargetReceptor-type tyrosine-protein phosphatase beta
LigandBDBM26613
Substrate/Competitorn/a
Meas. Tech.ChEMBL_829768 (CHEMBL2061287)
IC50 770±n/a nM
Citation Mak, LHKnott, JScott, KAScott, CWhyte, GFYe, YMann, DJCes, OStivers, JWoscholski, R Arylstibonic acids are potent and isoform-selective inhibitors of Cdc25a and Cdc25b phosphatases. Bioorg Med Chem20:4371-6 (2012) 
 
Receptor-type tyrosine-protein phosphatase beta
Name:Receptor-type tyrosine-protein phosphatase beta
Type:Protein
Mol. Mass.:224324.80
Organism:Homo sapiens (Human)
Description:P23467
Residue:1997
BDBM26613
NameBDBM26613
Synonyms:(2E)-3-{3-[dihydroxy(oxo)--stibanyl]phenyl}prop-2-enoic acid | Compound 13778
TypeSmall organic molecule
Emp. Form.C9H9O5Sb
Mol. Mass.318.92
SMILESOC(=O)\C=C\c1cccc(c1)[Sb](O)(O)=O