Reaction Details
TargetType-1 angiotensin II receptor
LigandBDBM50043280
Substrate/Competitorn/a
Meas. Tech.ChEMBL_830165 (CHEMBL2061975)
IC50 150±n/a nM
Citation Zhang, JWang, JLZhou, ZMLi, ZHXue, WZXu, DHao, LPHan, XFFei, FLiu, TLiang, AH Design, synthesis and biological activity of 6-substituted carbamoyl benzimidazoles as new nonpeptidic angiotensin II AT1 receptor antagonists. Bioorg Med Chem20:4208-16 (2012) 
 
Type-1 angiotensin II receptor
Name:Type-1 angiotensin II receptor
Type:Protein
Mol. Mass.:41080.75
Organism:Homo sapiens (Human)
Description:P30556
Residue:359
BDBM50043280
NameBDBM50043280
Synonyms:4'-((1,4'-dimethyl-2'-propyl(2,6'-bi-1H-benzimidazol)-1'-yl)methyl)-(1,1'-biphenyl)-2-carboxylic acid 4'-[(1,4'-dimethyl-2'propyl[2,6'-bi-1H-benzimidazol]-1'-yl)methyl]-[1,1'-biphenyl]-2-carboxylic acid 4'-[(1,7'-dimethyl-2'-propyl-1H,3'H-2,5'-bibenzimidazol-3'-yl)methyl]biphenyl-2-carboxylic acid CHEMBL1017 | TELMISARTAN
TypeSmall organic molecule
Emp. Form.C33H30N4O2
Mol. Mass.514.6169
SMILESCCCc1nc2c(C)cc(cc2n1Cc1ccc(cc1)-c1ccccc1C(O)=O)-c1nc2ccccc2n1C