Reaction Details
TargetCasein kinase II subunit alpha
LigandBDBM50388786
Substrate/Competitorn/a
Meas. Tech.ChEMBL_830890 (CHEMBL2065439)
IC50 10±n/a nM
Citation Dowling, JEChuaqui, CPontz, TWLyne, PDLarsen, NABlock, MHChen, HSu, NWu, ARussell, DPollard, HLee, JWPeng, BThakur, KYe, QZhang, TBrassil, PRacicot, VBao, LDenz, CRCooke, E Potent and Selective Inhibitors of CK2 Kinase Identified through Structure-Guided Hybridization. ACS Med Chem Lett3:278-283 (2012) 
 
Casein kinase II subunit alpha
Name:Casein kinase II subunit alpha
Type:Enzyme
Mol. Mass.:45151.12
Organism:Homo sapiens (Human)
Description:P68400
Residue:391
BDBM50388786
NameBDBM50388786
Synonyms:CHEMBL2062563
TypeSmall organic molecule
Emp. Form.C20H17N7O
Mol. Mass.371.3953
SMILESCC(=O)Nc1ccc2ccn(-c3cc(NC4CC4)n4ncc(C#N)c4n3)c2c1