Reaction Details
TargetM-phase inducer phosphatase 1
LigandBDBM50388810
Substrate/Competitorn/a
Meas. Tech.ChEMBL_830915 (CHEMBL2065464)
IC50 6250±n/a nM
Citation Tsuchiya, AHirai, GKoyama, YOonuma, KOtani, YOsada, HSodeoka, M Dual-Specificity Phosphatase CDC25A/B Inhibitor Identified from a Focused Library with Nonelectrophilic Core Structure. ACS Med Chem Lett3:294-298 (2012) 
 
M-phase inducer phosphatase 1
Name:M-phase inducer phosphatase 1
Type:Protein
Mol. Mass.:59090.18
Organism:Homo sapiens (Human)
Description:P30304
Residue:524
BDBM50388810
NameBDBM50388810
Synonyms:CHEMBL2062598
TypeSmall organic molecule
Emp. Form.C28H42ClNO4
Mol. Mass.492.09
(NCc1ccc(Cl)cc1)=C1C(=O)OC(CO)C1=O