Reaction Details
TargetM-phase inducer phosphatase 2
LigandBDBM50388808
Substrate/Competitorn/a
Meas. Tech.ChEMBL_830916 (CHEMBL2065465)
IC50 6550±n/a nM
Citation Tsuchiya, AHirai, GKoyama, YOonuma, KOtani, YOsada, HSodeoka, M Dual-Specificity Phosphatase CDC25A/B Inhibitor Identified from a Focused Library with Nonelectrophilic Core Structure. ACS Med Chem Lett3:294-298 (2012) 
 
M-phase inducer phosphatase 2
Name:M-phase inducer phosphatase 2
Type:Protein
Mol. Mass.:64985.27
Organism:Homo sapiens (Human)
Description:n/a
Residue:580
BDBM50388808
NameBDBM50388808
Synonyms:CHEMBL2062596
TypeSmall organic molecule
Emp. Form.C30H48N2O4
Mol. Mass.500.7131
(NCc1cccc(c1)N(C)C)=C1C(=O)OC(CO)C1=O