Reaction Details
TargetDual specificity protein phosphatase 3
LigandBDBM50388809
Substrate/Competitorn/a
Meas. Tech.ChEMBL_830918 (CHEMBL2065467)
IC50 2680±n/a nM
Citation Tsuchiya, AHirai, GKoyama, YOonuma, KOtani, YOsada, HSodeoka, M Dual-Specificity Phosphatase CDC25A/B Inhibitor Identified from a Focused Library with Nonelectrophilic Core Structure. ACS Med Chem Lett3:294-298 (2012) 
 
Dual specificity protein phosphatase 3
Name:Dual specificity protein phosphatase 3
Type:Hydrolase
Mol. Mass.:20480.58
Organism:Homo sapiens (Human)
Description:n/a
Residue:185
BDBM50388809
NameBDBM50388809
Synonyms:CHEMBL2062597
TypeSmall organic molecule
Emp. Form.C29H45NO4
Mol. Mass.471.6719
(NCc1ccc(C)cc1)=C1C(=O)OC(CO)C1=O