Reaction Details
TargetM-phase inducer phosphatase 2
LigandBDBM50388818
Substrate/Competitorn/a
Meas. Tech.ChEMBL_830931 (CHEMBL2065531)
IC50 4260±n/a nM
Citation Tsuchiya, AHirai, GKoyama, YOonuma, KOtani, YOsada, HSodeoka, M Dual-Specificity Phosphatase CDC25A/B Inhibitor Identified from a Focused Library with Nonelectrophilic Core Structure. ACS Med Chem Lett3:294-298 (2012) 
 
M-phase inducer phosphatase 2
Name:M-phase inducer phosphatase 2
Type:Protein
Mol. Mass.:64985.27
Organism:Homo sapiens (Human)
Description:n/a
Residue:580
BDBM50388818
NameBDBM50388818
Synonyms:CHEMBL2062712
TypeSmall organic molecule
Emp. Form.C28H43NO5
Mol. Mass.473.6447
(NCc1ccccc1O)=C1C(=O)OC(CO)C1=O