Reaction Details
TargetM-phase inducer phosphatase 2
LigandBDBM50388826
Substrate/Competitorn/a
Meas. Tech.ChEMBL_830931 (CHEMBL2065531)
IC50 740±n/a nM
Citation Tsuchiya, AHirai, GKoyama, YOonuma, KOtani, YOsada, HSodeoka, M Dual-Specificity Phosphatase CDC25A/B Inhibitor Identified from a Focused Library with Nonelectrophilic Core Structure. ACS Med Chem Lett3:294-298 (2012) 
 
M-phase inducer phosphatase 2
Name:M-phase inducer phosphatase 2
Type:Protein
Mol. Mass.:64985.27
Organism:Homo sapiens (Human)
Description:n/a
Residue:580
BDBM50388826
NameBDBM50388826
Synonyms:CHEMBL2062715
TypeSmall organic molecule
Emp. Form.C16H18ClN3O2
Mol. Mass.319.786
SMILESOc1c(Cl)c(N=CCN2CCCCC2)c(O)c2ncccc12