Reaction Details
TargetDynamin-1
LigandBDBM50388830
Substrate/Competitorn/a
Meas. Tech.ChEMBL_831002 (CHEMBL2065654)
IC50>100000±n/a nM
Citation Robertson, MJHadzic, GAmbrus, JPomè, DYHyde, EWhiting, AMariana, Avon Kleist, LChau, NHaucke, VRobinson, PJMcCluskey, A The Rhodadyns, a New Class of Small Molecule Inhibitors of Dynamin GTPase Activity. ACS Med Chem Lett3:352-356 (2012) 
 
Dynamin-1
Name:Dynamin-1
Type:PROTEIN
Mol. Mass.:97411.67
Organism:Homo sapiens (Human)
Description:ChEMBL_1458576
Residue:864
BDBM50388830
NameBDBM50388830
Synonyms:CHEMBL2062756
TypeSmall organic molecule
Emp. Form.C14H8ClNO3S3
Mol. Mass.369.866
SMILESOC(=O)CN1C(=S)S\C(=C/c2csc3ccc(Cl)cc23)C1=O