Reaction Details
TargetSodium-dependent dopamine transporter
LigandBDBM50388871
Substrate/Competitorn/a
Meas. Tech.ChEMBL_830828 (CHEMBL2065334)
Ki 4±n/a nM
Citation Lapinsky, DJYarravarapu, NNolan, TLSurratt, CKLever, JRTomlinson, MVaughan, RADeutsch, HM Evolution of a Compact Photoprobe for the Dopamine Transporter Based on (±)-threo-Methylphenidate. ACS Med Chem Lett3:378-382 (2012) 
 
Sodium-dependent dopamine transporter
Name:Sodium-dependent dopamine transporter
Type:Multi-pass membrane protein
Mol. Mass.:68497.11
Organism:Homo sapiens (Human)
Description:Q01959
Residue:620
BDBM50388871
NameBDBM50388871
Synonyms:CHEMBL2062931
TypeSmall organic molecule
Emp. Form.C14H17IN4O2
Mol. Mass.400.2149
SMILESCOC(=O)[C@@H]([C@H]1CCCCN1)c1ccc(N=[N+]=[N-])c(I)c1