Reaction Details
TargetCyclin-dependent kinase 1
LigandBDBM50388878
Substrate/Competitorn/a
Meas. Tech.ChEMBL_830840 (CHEMBL2065346)
Ki 5±n/a nM
Citation Milletti, FHermann, JC Targeted kinase selectivity from kinase profiling data. ACS Med Chem Lett3:383-386 (2012) 
 
Cyclin-dependent kinase 1
Name:Cyclin-dependent kinase 1
Type:Enzyme Subunit
Mol. Mass.:34101.08
Organism:Homo sapiens (Human)
Description:P06493
Residue:297
BDBM50388878
NameBDBM50388878
Synonyms:CHEMBL1999931 | US9163007, 73
TypeSmall organic molecule
Emp. Form.C23H18N6O
Mol. Mass.394.4286
SMILESO=C(Nc1n[nH]c2ccc(cc12)-c1cn(Cc2ccccc2)nn1)c1ccccc1