Reaction Details
TargetCyclin-dependent kinase 1
LigandBDBM50388879
Substrate/Competitorn/a
Meas. Tech.ChEMBL_830840 (CHEMBL2065346)
Ki<10000±n/a nM
Citation Milletti, FHermann, JC Targeted kinase selectivity from kinase profiling data. ACS Med Chem Lett3:383-386 (2012) 
 
Cyclin-dependent kinase 1
Name:Cyclin-dependent kinase 1
Type:Enzyme Subunit
Mol. Mass.:34101.08
Organism:Homo sapiens (Human)
Description:P06493
Residue:297
BDBM50388879
NameBDBM50388879
Synonyms:CHEMBL2062937
TypeSmall organic molecule
Emp. Form.C19H23ClN6
Mol. Mass.370.879
SMILESCN(C)[C@H]1CC[C@@H](CC1)Nc1nc(Cl)cc(n1)-c1c[nH]c2ncccc12