Reaction Details
TargetEpidermal growth factor receptor
LigandBDBM50142887
Substrate/Competitorn/a
Meas. Tech.ChEMBL_830842 (CHEMBL2065348)
Ki<10000±n/a nM
Citation Milletti, FHermann, JC Targeted kinase selectivity from kinase profiling data. ACS Med Chem Lett3:383-386 (2012) 
 
Epidermal growth factor receptor
Name:Epidermal growth factor receptor
Type:Receptor Kinase Domain
Mol. Mass.:134279.59
Organism:Homo sapiens (Human)
Description:P00533
Residue:1210
BDBM50142887
NameBDBM50142887
Synonyms:1-(tert-butyl)-3-(4-chlorophenyl)-4-aminopyrazolo[3,4-d]pyrimidine 1-tert-butyl-3-(4-chlorophenyl)-1H-pyrazolo[3,4-d]pyrimidin-4-amine 4-amino-5-(4-chlorophenyl)-7-(tert-butyl)pyrazolo[3,4-d]pyrimidine CHEMBL406845 US10544104, Compound 146 US11701353, PP2 (Pfizer) cid_4878
TypeSmall organic molecule
Emp. Form.C15H16ClN5
Mol. Mass.301.774
SMILESCC(C)(C)n1nc(-c2ccc(Cl)cc2)c2c(N)ncnc12