Reaction Details
TargetMacrophage colony-stimulating factor 1 receptor
LigandBDBM50381703
Substrate/Competitorn/a
Meas. Tech.ChEMBL_830843 (CHEMBL2065349)
Ki 2±n/a nM
Citation Milletti, FHermann, JC Targeted kinase selectivity from kinase profiling data. ACS Med Chem Lett3:383-386 (2012) 
 
Macrophage colony-stimulating factor 1 receptor
Name:Macrophage colony-stimulating factor 1 receptor
Type:Protein
Mol. Mass.:107979.48
Organism:Homo sapiens (Human)
Description:P07333
Residue:972
BDBM50381703
NameBDBM50381703
Synonyms:CHEMBL1970317
TypeSmall organic molecule
Emp. Form.C24H19FN6OS
Mol. Mass.458.511
SMILESCn1cc(cn1)-c1cnc(N)c2c(csc12)-c1ccc(NC(=O)Nc2cccc(F)c2)cc1