Reaction Details
TargetTyrosine-protein kinase ABL1
LigandBDBM50381719
Substrate/Competitorn/a
Meas. Tech.ChEMBL_830838 (CHEMBL2065344)
Ki 0.794328±n/a nM
Citation Milletti, FHermann, JC Targeted kinase selectivity from kinase profiling data. ACS Med Chem Lett3:383-386 (2012) 
 
Tyrosine-protein kinase ABL1
Name:Tyrosine-protein kinase ABL1
Type:Enzyme
Mol. Mass.:122897.30
Organism:Homo sapiens (Human)
Description:P00519
Residue:1130
BDBM50381719
NameBDBM50381719
Synonyms:CHEMBL2022856
TypeSmall organic molecule
Emp. Form.C26H23FN6O2S
Mol. Mass.502.563
SMILESC[C@@H](O)Cn1cc(cn1)-c1cnc(N)c2c(csc12)-c1ccc(NC(=O)Nc2cccc(F)c2)cc1