Reaction Details
TargetCalcitonin gene-related peptide type 1 receptor
LigandBDBM50382794
Substrate/Competitorn/a
Meas. Tech.ChEMBL_830950 (CHEMBL2065550)
Ki 0.071±n/a nM
Citation Luo, GChen, LConway, CMDenton, RKeavy, DGulianello, MHuang, YKostich, WLentz, KAMercer, SESchartman, RSignor, LBrowning, MMacor, JEDubowchik, GM Discovery of BMS-846372, a Potent and Orally Active Human CGRP Receptor Antagonist for the Treatment of Migraine. ACS Med Chem Lett3:337-341 (2012) 
 
Calcitonin gene-related peptide type 1 receptor
Name:Calcitonin gene-related peptide type 1 receptor
Type:Enzyme Catalytic Domain
Mol. Mass.:52980.45
Organism:Homo sapiens (Human)
Description:Q16602
Residue:461
BDBM50382794
NameBDBM50382794
Synonyms:CHEMBL2023191
TypeSmall organic molecule
Emp. Form.C30H31ClN8O4
Mol. Mass.603.071
SMILESCN(C)C(=O)c1cc(Cl)nc(c1)C(Cc1cc(C)c2[nH]ncc2c1)OC(=O)N1CCC(CC1)n1c2cccnc2[nH]c1=O