Reaction Details
TargetCannabinoid receptor 1
LigandBDBM50388886
Substrate/Competitorn/a
Meas. Tech.ChEMBL_830979 (CHEMBL2065579)
Ki 0.87±n/a nM
Citation Dow, RLCarpino, PAGautreau, DHadcock, JRIredale, PAKelly-Sullivan, DLizano, JSSchneider, SRScott, DOWard, KM Design of a Potent CB1 Receptor Antagonist Series: Potential Scaffold for Peripherally-Targeted Agents. ACS Med Chem Lett3:397-401 (2012) 
 
Cannabinoid receptor 1
Name:Cannabinoid receptor 1
Type:G Protein-Coupled Receptor (GPCR)
Mol. Mass.:52868.96
Organism:Homo sapiens (Human)
Description:P21554
Residue:472
BDBM50388886
NameBDBM50388886
Synonyms:CHEMBL2063122
TypeSmall organic molecule
Emp. Form.C21H19Cl2N3O2
Mol. Mass.416.3
SMILESCC(=O)NC1CCCOc2c1nn(c2-c1ccc(Cl)cc1)-c1ccccc1Cl