Reaction Details
TargetCannabinoid receptor 1
LigandBDBM50388887
Substrate/Competitorn/a
Meas. Tech.ChEMBL_830976 (CHEMBL2065576)
Ki 0.09±n/a nM
Citation Dow, RLCarpino, PAGautreau, DHadcock, JRIredale, PAKelly-Sullivan, DLizano, JSSchneider, SRScott, DOWard, KM Design of a Potent CB1 Receptor Antagonist Series: Potential Scaffold for Peripherally-Targeted Agents. ACS Med Chem Lett3:397-401 (2012) 
 
Cannabinoid receptor 1
Name:Cannabinoid receptor 1
Type:G Protein-Coupled Receptor (GPCR)
Mol. Mass.:52868.96
Organism:Homo sapiens (Human)
Description:P21554
Residue:472
BDBM50388887
NameBDBM50388887
Synonyms:CHEMBL2063240
TypeSmall organic molecule
Emp. Form.C25H25Cl2N3O3
Mol. Mass.486.39
SMILESClc1ccc(cc1)-c1c2OCCCC(NC(=O)C3CCOCC3)c2nn1-c1ccccc1Cl