Reaction Details
TargetCannabinoid receptor 1
LigandBDBM50388892
Substrate/Competitorn/a
Meas. Tech.ChEMBL_830976 (CHEMBL2065576)
Ki 0.12±n/a nM
Citation Dow, RLCarpino, PAGautreau, DHadcock, JRIredale, PAKelly-Sullivan, DLizano, JSSchneider, SRScott, DOWard, KM Design of a Potent CB1 Receptor Antagonist Series: Potential Scaffold for Peripherally-Targeted Agents. ACS Med Chem Lett3:397-401 (2012) 
 
Cannabinoid receptor 1
Name:Cannabinoid receptor 1
Type:G Protein-Coupled Receptor (GPCR)
Mol. Mass.:52868.96
Organism:Homo sapiens (Human)
Description:P21554
Residue:472
BDBM50388892
NameBDBM50388892
Synonyms:CHEMBL2063245
TypeSmall organic molecule
Emp. Form.C22H22Cl2N4O2
Mol. Mass.445.342
SMILESCCNC(=O)NC1CCCOc2c1nn(c2-c1ccc(Cl)cc1)-c1ccccc1Cl