Reaction Details
TargetCannabinoid receptor 2
LigandBDBM50388901
Substrate/Competitorn/a
Meas. Tech.ChEMBL_830977 (CHEMBL2065577)
Ki 3290±n/a nM
Citation Dow, RLCarpino, PAGautreau, DHadcock, JRIredale, PAKelly-Sullivan, DLizano, JSSchneider, SRScott, DOWard, KM Design of a Potent CB1 Receptor Antagonist Series: Potential Scaffold for Peripherally-Targeted Agents. ACS Med Chem Lett3:397-401 (2012) 
 
Cannabinoid receptor 2
Name:Cannabinoid receptor 2
Type:G Protein-Coupled Receptor (GPCR)
Mol. Mass.:39690.94
Organism:Homo sapiens (Human)
Description:P34972
Residue:360
BDBM50388901
NameBDBM50388901
Synonyms:CHEMBL2063237
TypeSmall organic molecule
Emp. Form.C23H23Cl2N3O2
Mol. Mass.444.354
SMILESCC(C)C(=O)N[C@@H]1CCCOc2c1nn(c2-c1ccc(Cl)cc1)-c1ccccc1Cl