Reaction Details
TargetMatrix metalloproteinase-14
LigandBDBM50388911
Substrate/Competitorn/a
Meas. Tech.ChEMBL_831080 (CHEMBL2065781)
Ki 580±n/a nM
Citation Lee, MIkejiri, MKlimpel, DToth, MEspahbodi, MHesek, DForbes, CKumarasiri, MNoll, BCChang, MMobashery, S Structure-Activity Relationship for Thiirane-Based Gelatinase Inhibitors. ACS Med Chem Lett3:490-495 (2012) 
 
Matrix metalloproteinase-14
Name:Matrix metalloproteinase-14
Type:Protein
Mol. Mass.:65900.19
Organism:Homo sapiens (Human)
Description:P50281
Residue:582
BDBM50388911
NameBDBM50388911
Synonyms:CHEMBL2063270
TypeSmall organic molecule
Emp. Form.C15H13FO3S2
Mol. Mass.324.39
SMILESFc1ccc(Oc2ccc(cc2)S(=O)(=O)CC2CS2)cc1