Reaction Details
Target72 kDa type IV collagenase
LigandBDBM50388912
Substrate/Competitorn/a
Meas. Tech.ChEMBL_831070 (CHEMBL2065771)
Ki 78±n/a nM
Citation Lee, MIkejiri, MKlimpel, DToth, MEspahbodi, MHesek, DForbes, CKumarasiri, MNoll, BCChang, MMobashery, S Structure-Activity Relationship for Thiirane-Based Gelatinase Inhibitors. ACS Med Chem Lett3:490-495 (2012) 
 
72 kDa type IV collagenase
Name:72 kDa type IV collagenase
Type:Enzyme
Mol. Mass.:73870.36
Organism:Homo sapiens (Human)
Description: P08253
Residue:660
BDBM50388912
NameBDBM50388912
Synonyms:CHEMBL2063273
TypeSmall organic molecule
Emp. Form.C16H16O4S2
Mol. Mass.336.426
SMILESOCc1ccc(Oc2ccc(cc2)S(=O)(=O)CC2CS2)cc1