Reaction Details
Target72 kDa type IV collagenase
LigandBDBM50388916
Substrate/Competitorn/a
Meas. Tech.ChEMBL_831070 (CHEMBL2065771)
Ki 180±n/a nM
Citation Lee, MIkejiri, MKlimpel, DToth, MEspahbodi, MHesek, DForbes, CKumarasiri, MNoll, BCChang, MMobashery, S Structure-Activity Relationship for Thiirane-Based Gelatinase Inhibitors. ACS Med Chem Lett3:490-495 (2012) 
 
72 kDa type IV collagenase
Name:72 kDa type IV collagenase
Type:Enzyme
Mol. Mass.:73870.36
Organism:Homo sapiens (Human)
Description: P08253
Residue:660
BDBM50388916
NameBDBM50388916
Synonyms:CHEMBL2063276
TypeSmall organic molecule
Emp. Form.C17H18O5S2
Mol. Mass.366.452
SMILESCOCOc1ccc(Oc2ccc(cc2)S(=O)(=O)CC2CS2)cc1