Reaction Details
Target72 kDa type IV collagenase
LigandBDBM50388917
Substrate/Competitorn/a
Meas. Tech.ChEMBL_831070 (CHEMBL2065771)
Ki 110±n/a nM
Citation Lee, MIkejiri, MKlimpel, DToth, MEspahbodi, MHesek, DForbes, CKumarasiri, MNoll, BCChang, MMobashery, S Structure-Activity Relationship for Thiirane-Based Gelatinase Inhibitors. ACS Med Chem Lett3:490-495 (2012) 
 
72 kDa type IV collagenase
Name:72 kDa type IV collagenase
Type:Enzyme
Mol. Mass.:73870.36
Organism:Homo sapiens (Human)
Description: P08253
Residue:660
BDBM50388917
NameBDBM50388917
Synonyms:CHEMBL2063277
TypeSmall organic molecule
Emp. Form.C16H13F3O4S2
Mol. Mass.390.397
SMILESFC(F)(F)Oc1ccc(Oc2ccc(cc2)S(=O)(=O)CC2CS2)cc1