Reaction Details
TargetStromelysin-1
LigandBDBM50388916
Substrate/Competitorn/a
Meas. Tech.ChEMBL_831071 (CHEMBL2065772)
Ki 12000±n/a nM
Citation Lee, MIkejiri, MKlimpel, DToth, MEspahbodi, MHesek, DForbes, CKumarasiri, MNoll, BCChang, MMobashery, S Structure-Activity Relationship for Thiirane-Based Gelatinase Inhibitors. ACS Med Chem Lett3:490-495 (2012) 
 
Stromelysin-1
Name:Stromelysin-1
Type:Enzyme
Mol. Mass.:53973.13
Organism:Homo sapiens (Human)
Description: P08254
Residue:477
BDBM50388916
NameBDBM50388916
Synonyms:CHEMBL2063276
TypeSmall organic molecule
Emp. Form.C17H18O5S2
Mol. Mass.366.452
SMILESCOCOc1ccc(Oc2ccc(cc2)S(=O)(=O)CC2CS2)cc1