Reaction Details
TargetMatrilysin
LigandBDBM50388914
Substrate/Competitorn/a
Meas. Tech.ChEMBL_831074 (CHEMBL2065775)
Ki 31000±n/a nM
Citation Lee, MIkejiri, MKlimpel, DToth, MEspahbodi, MHesek, DForbes, CKumarasiri, MNoll, BCChang, MMobashery, S Structure-Activity Relationship for Thiirane-Based Gelatinase Inhibitors. ACS Med Chem Lett3:490-495 (2012) 
 
Matrilysin
Name:Matrilysin
Type:Enzyme
Mol. Mass.:29681.54
Organism:Homo sapiens (Human)
Description:P09237
Residue:267
BDBM50388914
NameBDBM50388914
Synonyms:CHEMBL2063274 | US10357546, p-OH SB-3CT
TypeSmall organic molecule
Emp. Form.C15H14O4S2
Mol. Mass.322.399
SMILESOc1ccc(Oc2ccc(cc2)S(=O)(=O)CC2CS2)cc1