Reaction Details
TargetMatrix metalloproteinase-9
LigandBDBM50388910
Substrate/Competitorn/a
Meas. Tech.ChEMBL_831079 (CHEMBL2065780)
Ki 3000±n/a nM
Citation Lee, MIkejiri, MKlimpel, DToth, MEspahbodi, MHesek, DForbes, CKumarasiri, MNoll, BCChang, MMobashery, S Structure-Activity Relationship for Thiirane-Based Gelatinase Inhibitors. ACS Med Chem Lett3:490-495 (2012) 
 
Matrix metalloproteinase-9
Name:Matrix metalloproteinase-9
Type:Enzyme
Mol. Mass.:78452.28
Organism:Homo sapiens (Human)
Description:P14780
Residue:707
BDBM50388910
NameBDBM50388910
Synonyms:CHEMBL2063271
TypeSmall organic molecule
Emp. Form.C15H13FO3S2
Mol. Mass.324.39
SMILESFc1cccc(Oc2ccc(cc2)S(=O)(=O)CC2CS2)c1