Reaction Details
TargetMatrix metalloproteinase-14
LigandBDBM50264809
Substrate/Competitorn/a
Meas. Tech.ChEMBL_831080 (CHEMBL2065781)
Ki 37±n/a nM
Citation Lee, MIkejiri, MKlimpel, DToth, MEspahbodi, MHesek, DForbes, CKumarasiri, MNoll, BCChang, MMobashery, S Structure-Activity Relationship for Thiirane-Based Gelatinase Inhibitors. ACS Med Chem Lett3:490-495 (2012) 
 
Matrix metalloproteinase-14
Name:Matrix metalloproteinase-14
Type:Protein
Mol. Mass.:65900.19
Organism:Homo sapiens (Human)
Description:P50281
Residue:582
BDBM50264809
NameBDBM50264809
Synonyms:2-((4-phenoxyphenylsulfonyl)methyl)thiirane Thiirane (deuterium), 1-d2 US10357546, SB-3CT
TypeSmall organic molecule
Emp. Form.C15H14O3S2
Mol. Mass.306.4
SMILESO=S(=O)(CC1CS1)c1ccc(Oc2ccccc2)cc1